Reaction Details
TargetKappa-type opioid receptor
LigandBDBM50056627
Substrate/Competitorn/a
Meas. Tech.ChEMBL_146524 (CHEMBL753836)
Ki 74±n/a nM
Citation Palmer, RBUpthagrove, ALNelson, WL (E)- and (Z)-7-arylidenenaltrexones: synthesis and opioid receptor radioligand displacement assays. J Med Chem40:749-53 (1997) 
 
Kappa-type opioid receptor
Name:Kappa-type opioid receptor
Type:G Protein-Coupled Receptor (GPCR)
Mol. Mass.:42744.99
Organism:Cavia porcellus (domestic guinea pig)
Description:P41144
Residue:380
BDBM50056627
NameBDBM50056627
Synonyms:4-cyclopropylmethyl-10,17-dihydroxy-15-[1-(2-naphthyl)-(E)-methylidene]-(5R,13R,17S)-12-oxa-4-azapentacyclo[9.6.1.01,13.05,17.07,18]octadeca-7(18),8,10-trien-14-one | CHEMBL164577
TypeSmall organic molecule
Emp. Form.C31H29NO4
Mol. Mass.479.5663
SMILESOc1ccc2C[C@H]3N(CC4CC4)CCC45[C@@H](Oc1c24)C(=O)C(C[C@@]35O)=Cc1ccc2ccccc2c1