Reaction Details
TargetDelta-type opioid receptor
LigandBDBM50454798
Substrate/Competitorn/a
Meas. Tech.ChEMBL_147153 (CHEMBL758178)
Ki 6.2±n/a nM
Citation Palmer, RBUpthagrove, ALNelson, WL (E)- and (Z)-7-arylidenenaltrexones: synthesis and opioid receptor radioligand displacement assays. J Med Chem40:749-53 (1997) 
 
Delta-type opioid receptor
Name:Delta-type opioid receptor
Type:G Protein-Coupled Receptor (GPCR)
Mol. Mass.:40382.98
Organism:Homo sapiens (Human)
Description:Competition binding assays were carried out using membrane preparations from transfected HN9.10 cells that constitutively expressed the delta opioid receptor.
Residue:372
BDBM50454798
NameBDBM50454798
Synonyms:7-Benzylidenenaltrexone | BNTX
TypeSmall organic molecule
Emp. Form.C27H27NO4
Mol. Mass.429.5076
SMILES[H][C@@]12Oc3c4c(C[C@@]5([H])N(CC6CC6)CC[C@@]14[C@@]5(O)C\C(=C/c1ccccc1)C2=O)ccc3O