Reaction Details
TargetKappa-type opioid receptor
LigandBDBM60212
Substrate/Competitorn/a
Meas. Tech.ChEMBL_146524 (CHEMBL753836)
Ki 1.1±n/a nM
Citation Palmer, RBUpthagrove, ALNelson, WL (E)- and (Z)-7-arylidenenaltrexones: synthesis and opioid receptor radioligand displacement assays. J Med Chem40:749-53 (1997) 
 
Kappa-type opioid receptor
Name:Kappa-type opioid receptor
Type:G Protein-Coupled Receptor (GPCR)
Mol. Mass.:42744.99
Organism:Cavia porcellus (domestic guinea pig)
Description:P41144
Residue:380
BDBM60212
NameBDBM60212
Synonyms:(4R,4aS,7aR,12bS)-3-(cyclopropylmethyl)-4a,9-bis(oxidanyl)-2,4,5,6,7a,13-hexahydro-1H-4,12-methanobenzofuro[3,2-e]isoquinoline-7-one;hydrochloride MLS000069607 SMR000058767 US9107954, naltrexone | cid_5485201
TypeSmall organic molecule
Emp. Form.C20H23NO4
Mol. Mass.341.4009
SMILESOc1ccc2C[C@H]3N(CC4CC4)CC[C@@]45[C@@H](Oc1c24)C(=O)CC[C@@]35O