Reaction Details
TargetIntegrase
LigandBDBM38549
Substrate/Competitorn/a
Meas. Tech.ChEMBL_90892 (CHEMBL701792)
IC50 78600±n/a nM
Citation Neamati, NHong, HMazumder, AWang, SSunder, SNicklaus, MCMilne, GWProksa, BPommier, Y Depsides and depsidones as inhibitors of HIV-1 integrase: discovery of novel inhibitors through 3D database searching. J Med Chem40:942-51 (1997) 
 
Integrase
Name:Integrase
Synonyms:Human immunodeficiency virus type 1 integrase
Type:PROTEIN
Mol. Mass.:32231.48
Organism:Human immunodeficiency virus 1
Description:ChEMBL_90865
Residue:288
BDBM38549
NameBDBM38549
TypeSmall organic molecule
Emp. Form.C23H16O6
Mol. Mass.388.3695
SMILESOC(=O)c1cc2ccccc2c(Cc2c(O)c(cc3ccccc23)C(O)=O)c1O