Reaction Details
Target5-hydroxytryptamine receptor 2C
LigandBDBM50056944
Substrate/Competitorn/a
Meas. Tech.ChEMBL_1849 (CHEMBL616820)
Ki 4050±n/a nM
Citation el Ahmad, YLaurent, EMaillet, PTalab, ATeste, JFDokhan, RTran, GOllivier, R New benzocycloalkylpiperazines, potent and selective 5-HT1A receptor ligands. J Med Chem40:952-60 (1997) 
 
5-hydroxytryptamine receptor 2C
Name:5-hydroxytryptamine receptor 2C
Type:G Protein-Coupled Receptor (GPCR)
Mol. Mass.:51836.79
Organism:Homo sapiens (Human)
Description:P28335
Residue:458
BDBM50056944
NameBDBM50056944
Synonyms:4-Fluoro-N-{2-[4-(1,2,3,4-tetrahydro-naphthalen-1-yl)-piperazin-1-yl]-ethyl}-benzamide | CHEMBL368061
TypeSmall organic molecule
Emp. Form.C23H28FN3O
Mol. Mass.381.4863
SMILESFc1ccc(cc1)C(=O)NCCN1CCN(CC1)C1CCCc2ccccc12