Reaction Details
Target5-hydroxytryptamine receptor 1A
LigandBDBM50001859
Substrate/Competitorn/a
Meas. Tech.ChEMBL_903 (CHEMBL615752)
Ki 15±n/a nM
Citation el Ahmad, YLaurent, EMaillet, PTalab, ATeste, JFDokhan, RTran, GOllivier, R New benzocycloalkylpiperazines, potent and selective 5-HT1A receptor ligands. J Med Chem40:952-60 (1997) 
 
5-hydroxytryptamine receptor 1A
Name:5-hydroxytryptamine receptor 1A
Type:n/a
Mol. Mass.:46122.49
Organism:Homo sapiens (Human)
Description:n/a
Residue:422
BDBM50001859
NameBDBM50001859
Synonyms:(buspirone) 8-[4-(4-Pyrimidin-2-yl-piperazin-1-yl)-butyl]-8-aza-spiro[4.5]decane-7,9-dione 8-[4-(4-Pyrimidin-2-yl-piperazin-1-yl)-butyl]-8-aza-spiro[4.5]decane-7,9-dione; Hydrochloride(Buspirone) BUSPAR CHEMBL49 | US10562853, Compound Buspirone
TypeSmall organic molecule
Emp. Form.C21H31N5O2
Mol. Mass.385.5031
SMILESO=C1CC2(CCCC2)CC(=O)N1CCCCN1CCN(CC1)c1ncccn1