Reaction Details
Target5-hydroxytryptamine receptor 1D
LigandBDBM50056944
Substrate/Competitorn/a
Meas. Tech.ChEMBL_1956 (CHEMBL617563)
Ki 9770±n/a nM
Citation el Ahmad, YLaurent, EMaillet, PTalab, ATeste, JFDokhan, RTran, GOllivier, R New benzocycloalkylpiperazines, potent and selective 5-HT1A receptor ligands. J Med Chem40:952-60 (1997) 
 
5-hydroxytryptamine receptor 1D
Name:5-hydroxytryptamine receptor 1D
Type:PROTEIN
Mol. Mass.:32680.56
Organism:Sus scrofa
Description:ChEMBL_1963
Residue:291
BDBM50056944
NameBDBM50056944
Synonyms:4-Fluoro-N-{2-[4-(1,2,3,4-tetrahydro-naphthalen-1-yl)-piperazin-1-yl]-ethyl}-benzamide | CHEMBL368061
TypeSmall organic molecule
Emp. Form.C23H28FN3O
Mol. Mass.381.4863
SMILESFc1ccc(cc1)C(=O)NCCN1CCN(CC1)C1CCCc2ccccc12