Reaction Details
TargetD(2) dopamine receptor
LigandBDBM50056944
Substrate/Competitorn/a
Meas. Tech.ChEMBL_59490 (CHEMBL670142)
Ki 740±n/a nM
Citation el Ahmad, YLaurent, EMaillet, PTalab, ATeste, JFDokhan, RTran, GOllivier, R New benzocycloalkylpiperazines, potent and selective 5-HT1A receptor ligands. J Med Chem40:952-60 (1997) 
 
D(2) dopamine receptor
Name:D(2) dopamine receptor
Type:Enzyme Catalytic Domain
Mol. Mass.:50698.79
Organism:BOVINE
Description:P20288
Residue:444
BDBM50056944
NameBDBM50056944
Synonyms:4-Fluoro-N-{2-[4-(1,2,3,4-tetrahydro-naphthalen-1-yl)-piperazin-1-yl]-ethyl}-benzamide | CHEMBL368061
TypeSmall organic molecule
Emp. Form.C23H28FN3O
Mol. Mass.381.4863
SMILESFc1ccc(cc1)C(=O)NCCN1CCN(CC1)C1CCCc2ccccc12