Reaction Details
TargetMuscarinic acetylcholine receptor M1
LigandBDBM50005677
Substrate/Competitorn/a
Meas. Tech.ChEMBL_138556 (CHEMBL746423)
EC50 700±n/a nM
Citation Messer, WSAbuh, YFLiu, YPeriyasamy, SNgur, DOEdgar, MAEl-Assadi, AASbeih, SDunbar, PGRoknich, SRho, TFang, ZOjo, BZhang, HHuzl, JJNagy, PI Synthesis and biological characterization of 1,4,5,6-tetrahydropyrimidine and 2-amino-3,4,5,6-tetrahydropyridine derivatives as selective m1 agonists. J Med Chem40:1230-46 (1997) 
 
Muscarinic acetylcholine receptor M1
Name:Muscarinic acetylcholine receptor M1
Type:Enzyme Catalytic Domain
Mol. Mass.:51400.50
Organism:Mus musculus
Description:Cholinergic, muscarinic 0 0::Q52KQ0
Residue:460
BDBM50005677
NameBDBM50005677
Synonyms:CHEMBL23957 Trimethyl-[4-(2-oxo-pyrrolidin-1-yl)-but-2-ynyl]-ammonium; iodide
TypeSmall organic molecule
Emp. Form.C11H19N2O
Mol. Mass.195.2808
SMILESC[N+](C)(C)CC#CCN1CCCC1=O