Reaction Details
TargetMuscarinic acetylcholine receptor M1
LigandBDBM50057403
Substrate/Competitorn/a
Meas. Tech.ChEMBL_138671 (CHEMBL748968)
Ki 17±n/a nM
Citation Messer, WSAbuh, YFLiu, YPeriyasamy, SNgur, DOEdgar, MAEl-Assadi, AASbeih, SDunbar, PGRoknich, SRho, TFang, ZOjo, BZhang, HHuzl, JJNagy, PI Synthesis and biological characterization of 1,4,5,6-tetrahydropyrimidine and 2-amino-3,4,5,6-tetrahydropyridine derivatives as selective m1 agonists. J Med Chem40:1230-46 (1997) 
 
Muscarinic acetylcholine receptor M1
Name:Muscarinic acetylcholine receptor M1
Type:Enzyme Catalytic Domain
Mol. Mass.:51400.50
Organism:Mus musculus
Description:Cholinergic, muscarinic 0 0::Q52KQ0
Residue:460
BDBM50057403
NameBDBM50057403
Synonyms:5-(3-Pent-1-ynyl-[1,2,4]oxadiazol-5-yl)-1,4,5,6-tetrahydro-pyrimidine; TFA | CHEMBL21284
TypeSmall organic molecule
Emp. Form.C11H14N4O
Mol. Mass.218.2551
SMILESCCCC#Cc1noc(n1)C1CNC=NC1