Reaction Details
TargetMuscarinic acetylcholine receptor M1
LigandBDBM50039843
Substrate/Competitorn/a
Meas. Tech.ChEMBL_138670 (CHEMBL748967)
Ki 42±n/a nM
Citation Messer, WSAbuh, YFLiu, YPeriyasamy, SNgur, DOEdgar, MAEl-Assadi, AASbeih, SDunbar, PGRoknich, SRho, TFang, ZOjo, BZhang, HHuzl, JJNagy, PI Synthesis and biological characterization of 1,4,5,6-tetrahydropyrimidine and 2-amino-3,4,5,6-tetrahydropyridine derivatives as selective m1 agonists. J Med Chem40:1230-46 (1997) 
 
Muscarinic acetylcholine receptor M1
Name:Muscarinic acetylcholine receptor M1
Type:Enzyme Catalytic Domain
Mol. Mass.:51400.50
Organism:Mus musculus
Description:Cholinergic, muscarinic 0 0::Q52KQ0
Residue:460
BDBM50039843
NameBDBM50039843
Synonyms:1,4,5,6-Tetrahydro-pyrimidine-5-carboxylic acid prop-2-ynyl ester; hydrochloride | CHEMBL542065
TypeSmall organic molecule
Emp. Form.C8H10N2O2
Mol. Mass.166.1772
SMILESO=C(OCC#C)C1CNC=NC1