Reaction Details
TargetMuscarinic acetylcholine receptor M1
LigandBDBM50057400
Substrate/Competitorn/a
Meas. Tech.ChEMBL_138671 (CHEMBL748968)
Ki 9±n/a nM
Citation Messer, WSAbuh, YFLiu, YPeriyasamy, SNgur, DOEdgar, MAEl-Assadi, AASbeih, SDunbar, PGRoknich, SRho, TFang, ZOjo, BZhang, HHuzl, JJNagy, PI Synthesis and biological characterization of 1,4,5,6-tetrahydropyrimidine and 2-amino-3,4,5,6-tetrahydropyridine derivatives as selective m1 agonists. J Med Chem40:1230-46 (1997) 
 
Muscarinic acetylcholine receptor M1
Name:Muscarinic acetylcholine receptor M1
Type:Enzyme Catalytic Domain
Mol. Mass.:51400.50
Organism:Mus musculus
Description:Cholinergic, muscarinic 0 0::Q52KQ0
Residue:460
BDBM50057400
NameBDBM50057400
Synonyms:1,4,5,6-Tetrahydro-pyrimidine-5-carboxylic acid but-2-ynyl ester; hydrochloride | CHEMBL542064
TypeSmall organic molecule
Emp. Form.C9H12N2O2
Mol. Mass.180.2038
SMILESCC#CCOC(=O)C1CNC=NC1