Reaction Details
TargetMuscarinic acetylcholine receptor M3
LigandBDBM50046728
Substrate/Competitorn/a
Meas. Tech.ChEMBL_138834 (CHEMBL753022)
EC50 2800±n/a nM
Citation Messer, WSAbuh, YFLiu, YPeriyasamy, SNgur, DOEdgar, MAEl-Assadi, AASbeih, SDunbar, PGRoknich, SRho, TFang, ZOjo, BZhang, HHuzl, JJNagy, PI Synthesis and biological characterization of 1,4,5,6-tetrahydropyrimidine and 2-amino-3,4,5,6-tetrahydropyridine derivatives as selective m1 agonists. J Med Chem40:1230-46 (1997) 
 
Muscarinic acetylcholine receptor M3
Name:Muscarinic acetylcholine receptor M3
Type:PROTEIN
Mol. Mass.:66232.94
Organism:Mus musculus
Description:ChEMBL_138834
Residue:589
BDBM50046728
NameBDBM50046728
Synonyms:1-Methyl-5-(3-methyl-[1,2,4]oxadiazol-5-yl)-1,2,3,6-tetrahydro-pyridine | CHEMBL12378
TypeSmall organic molecule
Emp. Form.C9H13N3O
Mol. Mass.179.219
SMILESCN1CCC=C(C1)c1nc(C)no1