Reaction Details
Target5-hydroxytryptamine receptor 1A
LigandBDBM50013019
Substrate/Competitorn/a
Meas. Tech.ChEMBL_1425 (CHEMBL616505)
Ki 46.0±n/a nM
Citation Yasunaga, TNaito, RKontani, TTsukamoto, SNomura, TYamaguchi, TMase, T N-[2-[(substituted chroman-8-yl)oxy]ethyl]-4-(4-methoxyphenyl)butylamines: synthesis and wide range of antagonism at the human 5-HT1A receptor. J Med Chem40:1252-7 (1997) 
 
5-hydroxytryptamine receptor 1A
Name:5-hydroxytryptamine receptor 1A
Type:G Protein-Coupled Receptor (GPCR)
Mol. Mass.:46445.29
Organism:Rattus norvegicus (rat)
Description:Binding assays were performed using rat hippocampal membranes.
Residue:422
BDBM50013019
NameBDBM50013019
Synonyms:(S)-7-(dipropylamino)-4-fluoro-5,6,7,8-tetrahydronaphthalen-1-ol (S)-UH-301 7-Dipropylamino-4-fluoro-5,6,7,8-tetrahydro-naphthalen-1-ol ((S)-UH301) UH-301
TypeSmall organic molecule
Emp. Form.C16H24FNO
Mol. Mass.265.3663
SMILESCCCN(CCC)[C@H]1CCc2c(F)ccc(O)c2C1