Reaction Details
Target3-oxo-5-alpha-steroid 4-dehydrogenase 1
LigandBDBM50039298
Substrate/Competitorn/a
Meas. Tech.ChEMBL_205219 (CHEMBL816493)
Ki 30±n/a nM
Citation Kenny, BBallard, SBlagg, JFox, D Pharmacological options in the treatment of benign prostatic hyperplasia. J Med Chem40:1293-315 (1997) 
 
3-oxo-5-alpha-steroid 4-dehydrogenase 1
Name:3-oxo-5-alpha-steroid 4-dehydrogenase 1
Type:Enzyme
Mol. Mass.:29472.80
Organism:Homo sapiens (Human)
Description:P18405
Residue:259
BDBM50039298
NameBDBM50039298
Synonyms:(1S,9aR,11aS)-9a,11a-Dimethyl-7-oxo-2,3,3a,3b,4,5,7,8,9,9a,9b,10,11,11a-tetradecahydro-1H-cyclopenta[i]phenanthridine-1-carboxylic acid benzhydryl-amide CHEMBL24088
TypeSmall organic molecule
Emp. Form.C32H38N2O2
Mol. Mass.482.6563
SMILESC[C@]12CCC3C(CN=C4CC(=O)CC[C@]34C)C1CC[C@@H]2C(=O)NC(c1ccccc1)c1ccccc1