Reaction Details
Target3-oxo-5-alpha-steroid 4-dehydrogenase 1
LigandBDBM50057479
Substrate/Competitorn/a
Meas. Tech.ChEMBL_205217 (CHEMBL816491)
IC50 26±n/a nM
Citation Kenny, BBallard, SBlagg, JFox, D Pharmacological options in the treatment of benign prostatic hyperplasia. J Med Chem40:1293-315 (1997) 
 
3-oxo-5-alpha-steroid 4-dehydrogenase 1
Name:3-oxo-5-alpha-steroid 4-dehydrogenase 1
Type:Enzyme
Mol. Mass.:29472.80
Organism:Homo sapiens (Human)
Description:P18405
Residue:259
BDBM50057479
NameBDBM50057479
Synonyms:7-Bromo-9,10-dihydro-phenanthrene-2-carboxylic acid | CHEMBL25578
TypeSmall organic molecule
Emp. Form.C15H11BrO2
Mol. Mass.303.151
SMILESOC(=O)c1ccc-2c(CCc3cc(Br)ccc-23)c1