Reaction Details
Target3-oxo-5-alpha-steroid 4-dehydrogenase 1
LigandBDBM50057484
Substrate/Competitorn/a
Meas. Tech.ChEMBL_205219 (CHEMBL816493)
Ki 0.20±n/a nM
Citation Kenny, BBallard, SBlagg, JFox, D Pharmacological options in the treatment of benign prostatic hyperplasia. J Med Chem40:1293-315 (1997) 
 
3-oxo-5-alpha-steroid 4-dehydrogenase 1
Name:3-oxo-5-alpha-steroid 4-dehydrogenase 1
Type:Enzyme
Mol. Mass.:29472.80
Organism:Homo sapiens (Human)
Description:P18405
Residue:259
BDBM50057484
NameBDBM50057484
Synonyms:(1S,9aR,11aS)-6,9a,11a-Trimethyl-7-oxo-2,3,3a,3b,4,5,7,8,9,9a,9b,10,11,11a-tetradecahydro-1H-cyclopenta[i]phenanthridine-1-carboxylic acid (2,5-bis-trifluoromethyl-phenyl)-amide | CHEMBL25183
TypeSmall organic molecule
Emp. Form.C28H32F6N2O2
Mol. Mass.542.5563
SMILESCC1C(=O)CC[C@]2(C)C3CC[C@@]4(C)C(CC[C@@H]4C(=O)Nc4cc(ccc4C(F)(F)F)C(F)(F)F)C3CN=C12