Reaction Details
Target3 beta-hydroxysteroid dehydrogenase/Delta 5-->4-isomerase type 1
LigandBDBM50057504
Substrate/Competitorn/a
Meas. Tech.ChEMBL_328 (CHEMBL615301)
IC50 8.3±n/a nM
Citation Kenny, BBallard, SBlagg, JFox, D Pharmacological options in the treatment of benign prostatic hyperplasia. J Med Chem40:1293-315 (1997) 
 
3 beta-hydroxysteroid dehydrogenase/Delta 5-->4-isomerase type 1
Name:3 beta-hydroxysteroid dehydrogenase/Delta 5-->4-isomerase type 1
Type:PROTEIN
Mol. Mass.:42261.17
Organism:Homo sapiens (Human)
Description:ChEMBL_241
Residue:373
BDBM50057504
NameBDBM50057504
Synonyms:(1S,9aR,11aS)-9a,11a-Dimethyl-7-oxo-2,3,3a,3b,4,5,7,8,9,9a,9b,10,11,11a-tetradecahydro-1H-cyclopenta[i]phenanthridine-1-carboxylic acid (3,3-dimethyl-butyl)-amide | CHEMBL24033
TypeSmall organic molecule
Emp. Form.C25H40N2O2
Mol. Mass.400.5973
SMILESCC(C)(C)CCNC(=O)[C@H]1CCC2C3CN=C4CC(=O)CC[C@]4(C)C3CC[C@]12C