Reaction Details
Target3-oxo-5-alpha-steroid 4-dehydrogenase 1
LigandBDBM50057498
Substrate/Competitorn/a
Meas. Tech.ChEMBL_205221 (CHEMBL816495)
Ki>2500±n/a nM
Citation Kenny, BBallard, SBlagg, JFox, D Pharmacological options in the treatment of benign prostatic hyperplasia. J Med Chem40:1293-315 (1997) 
 
3-oxo-5-alpha-steroid 4-dehydrogenase 1
Name:3-oxo-5-alpha-steroid 4-dehydrogenase 1
Type:Enzyme
Mol. Mass.:29472.80
Organism:Homo sapiens (Human)
Description:P18405
Residue:259
BDBM50057498
NameBDBM50057498
Synonyms:5-Benzyloxy-1H-indole-2-carboxylic acid | CHEMBL24850
TypeSmall organic molecule
Emp. Form.C16H13NO3
Mol. Mass.267.2793
SMILESOC(=O)c1cc2cc(OCc3ccccc3)ccc2[nH]1