Reaction Details
TargetSodium-dependent serotonin transporter
LigandBDBM50057629
Substrate/Competitorn/a
Meas. Tech.ChEMBL_201800 (CHEMBL806135)
Ki 75±n/a nM
Citation Emond, PGarreau, LChalon, SBoazi, MCaillet, MBricard, JFrangin, YMauclaire, LBesnard, JCGuilloteau, D Synthesis and ligand binding of nortropane derivatives: N-substituted 2beta-carbomethoxy-3beta-(4'-iodophenyl)nortropane and N-(3-iodoprop-(2E)-enyl)-2beta-carbomethoxy-3beta-(3',4'-disubstituted phenyl)nortropane. New high-affinity and selective compounds for the dopamine transporter. J Med Chem40:1366-72 (1997) 
 
Sodium-dependent serotonin transporter
Name:Sodium-dependent serotonin transporter
Type:Multi-pass membrane protein
Mol. Mass.:70168.43
Organism:Rattus norvegicus (rat)
Description:P31652
Residue:630
BDBM50057629
NameBDBM50057629
Synonyms:(2S,8R)-8-((E)-But-2-enyl)-3-(4-iodo-phenyl)-8-aza-bicyclo[3.2.1]octane-2-carboxylic acid methyl ester
TypeSmall organic molecule
Emp. Form.C19H24INO2
Mol. Mass.425.3038
SMILESCOC(=O)[C@@H]1C2CCC(CC1c1ccc(I)cc1)N2C\C=C\C