Reaction Details
TargetAdenosine receptor A1
LigandBDBM50267393
Substrate/Competitorn/a
Meas. Tech.ChEMBL_29006 (CHEMBL643480)
Ki 62±n/a nM
Citation van der Wenden, EMCarnielli, MRoelen, HCLorenzen, Avon Frijtag Drabbe Künzel, JKIJzerman, AP 5'-substituted adenosine analogs as new high-affinity partial agonists for the adenosine A1 receptor. J Med Chem41:102-8 (1998) 
 
Adenosine receptor A1
Name:Adenosine receptor A1
Type:Protein
Mol. Mass.:36704.13
Organism:Rattus norvegicus (rat)
Description:n/a
Residue:326
BDBM50267393
NameBDBM50267393
Synonyms:CHEMBL477444 | N6-Cyclopentyl-9H-(5-chloro-5-deoxy-beta-D-ribofuranosyl)adenine
TypeSmall organic molecule
Emp. Form.C15H20ClN5O3
Mol. Mass.353.804
SMILESO[C@@H]1[C@@H](CCl)O[C@H]([C@@H]1O)n1cnc2c(NC3CCCC3)ncnc12