Reaction Details
TargetAdenosine receptor A1
LigandBDBM81786
Substrate/Competitorn/a
Meas. Tech.ChEMBL_29005 (CHEMBL643479)
Ki 59±n/a nM
Citation van der Wenden, EMCarnielli, MRoelen, HCLorenzen, Avon Frijtag Drabbe Künzel, JKIJzerman, AP 5'-substituted adenosine analogs as new high-affinity partial agonists for the adenosine A1 receptor. J Med Chem41:102-8 (1998) 
 
Adenosine receptor A1
Name:Adenosine receptor A1
Type:Protein
Mol. Mass.:36704.13
Organism:Rattus norvegicus (rat)
Description:n/a
Residue:326
BDBM81786
NameBDBM81786
Synonyms:5'-Methylthio Adenosine | 5'-Methylthioado
Typen/a
Emp. Form.C16H23N5O3S
Mol. Mass.365.451
SMILESCSC[C@H]1O[C@H]([C@H](O)[C@@H]1O)n1cnc2c(NC3CCCC3)ncnc12