Reaction Details
TargetCholecystokinin receptor type A
LigandBDBM50062005
Substrate/Competitorn/a
Meas. Tech.ChEMBL_50191 (CHEMBL663484)
IC50 26±n/a nM
Citation Trivedi, BKPadia, JKHolmes, ARose, SWright, DSHinton, JPPritchard, MCEden, JMKneen, CWebdale, LSuman-Chauhan, NBoden, PSingh, LField, MJHill, D Second generation"peptoid" CCK-B receptor antagonists: identification and development of N-(adamantyloxycarbonyl)-alpha-methyl-(R)-tryptophan derivative (CI-1015) with an improved pharmacokinetic profile. J Med Chem41:38-45 (1998) 
 
Cholecystokinin receptor type A
Name:Cholecystokinin receptor type A
Type:Enzyme Catalytic Domain
Mol. Mass.:49676.37
Organism:RAT
Description:Cholecystokinin central 0 RAT::P30551
Residue:444
BDBM50062005
NameBDBM50062005
Synonyms:(S)-3-[(R)-2-(Adamantan-2-yloxycarbonylamino)-3-(1H-indol-3-yl)-2-methyl-propionylamino]-4-phenyl-butyric acid CHEMBL138534 | PD-135666
TypeSmall organic molecule
Emp. Form.C33H39N3O5
Mol. Mass.557.6799
SMILESC[C@](Cc1c[nH]c2ccccc12)(NC(=O)OC1C2CC3CC(C2)CC1C3)C(=O)N[C@H](CC(O)=O)Cc1ccccc1