Reaction Details
TargetMuscarinic acetylcholine receptor M2
LigandBDBM50368882
Substrate/Competitorn/a
Meas. Tech.ChEMBL_140182 (CHEMBL744099)
Ki>10000±n/a nM
Citation Ronsisvalle, GMarrazzo, APrezzavento, OPasquinucci, LVittorio, FPittalà, VPappalardo, MSCacciaguerra, SSpampinato, S (+)-cis-N-ethyleneamino-N-normetazocine derivatives. Novel and selective sigma ligands with antagonist properties. J Med Chem41:1574-80 (1998) 
 
Muscarinic acetylcholine receptor M2
Name:Muscarinic acetylcholine receptor M2
Type:Enzyme Catalytic Domain
Mol. Mass.:51555.53
Organism:RAT
Description:P10980
Residue:466
BDBM50368882
NameBDBM50368882
Synonyms:CHEMBL147585 SK-10047
TypeSmall organic molecule
Emp. Form.C16H21NO
Mol. Mass.243.344
SMILESCC1C2Cc3ccc(O)cc3C1CCN2CC=C