Reaction Details
TargetD(2) dopamine receptor
LigandBDBM50368882
Substrate/Competitorn/a
Meas. Tech.ChEMBL_62572 (CHEMBL671503)
Ki>10000±n/a nM
Citation Ronsisvalle, GMarrazzo, APrezzavento, OPasquinucci, LVittorio, FPittalà, VPappalardo, MSCacciaguerra, SSpampinato, S (+)-cis-N-ethyleneamino-N-normetazocine derivatives. Novel and selective sigma ligands with antagonist properties. J Med Chem41:1574-80 (1998) 
 
D(2) dopamine receptor
Name:D(2) dopamine receptor
Type:G Protein-Coupled Receptor (GPCR)
Mol. Mass.:50931.60
Organism:Rattus norvegicus (rat)
Description:P61169
Residue:444
BDBM50368882
NameBDBM50368882
Synonyms:CHEMBL147585 SK-10047
TypeSmall organic molecule
Emp. Form.C16H21NO
Mol. Mass.243.344
SMILESCC1C2Cc3ccc(O)cc3C1CCN2CC=C