Reaction Details
TargetSigma non-opioid intracellular receptor 1
LigandBDBM50064191
Substrate/Competitorn/a
Meas. Tech.ChEMBL_200979 (CHEMBL801232)
Ki 7.4±n/a nM
Citation Ronsisvalle, GMarrazzo, APrezzavento, OPasquinucci, LVittorio, FPittalà, VPappalardo, MSCacciaguerra, SSpampinato, S (+)-cis-N-ethyleneamino-N-normetazocine derivatives. Novel and selective sigma ligands with antagonist properties. J Med Chem41:1574-80 (1998) 
 
Sigma non-opioid intracellular receptor 1
Name:Sigma non-opioid intracellular receptor 1
Type:Enzyme Catalytic Domain
Mol. Mass.:25124.85
Organism:Homo sapiens (Human)
Description:Q99720
Residue:223
BDBM50064191
NameBDBM50064191
Synonyms:(2S,6R,11S)-6,11-Dimethyl-3-(2-pyrrolidin-1-yl-ethyl)-1,2,3,4,5,6-hexahydro-2,6-methano-benzo[d]azocin-8-ol | CHEMBL43398
TypeSmall organic molecule
Emp. Form.C20H30N2O
Mol. Mass.314.465
SMILESC[C@@H]1[C@@H]2Cc3ccc(O)cc3[C@]1(C)CCN2CCN1CCCC1