Reaction Details
TargetAdenosine receptor A2a
LigandBDBM50224775
Substrate/Competitorn/a
Meas. Tech.ChEMBL_31057 (CHEMBL873042)
Ki 7220±n/a nM
Citation Franchetti, PCappellacci, LMarchetti, STrincavelli, LMartini, CMazzoni, MRLucacchini, AGrifantini, M 2'-C-Methyl analogues of selective adenosine receptor agonists: synthesis and binding studies. J Med Chem41:1708-15 (1998) 
 
Adenosine receptor A2a
Name:Adenosine receptor A2a
Type:G Protein-Coupled Receptor (GPCR)
Mol. Mass.:44716.46
Organism:Homo sapiens (Human)
Description:P29274
Residue:412
BDBM50224775
NameBDBM50224775
Synonyms:(2R,3R,4R,5R)-2-(6-(cyclopentylamino)-9H-purin-9-yl)-5-(hydroxymethyl)-3-methyl-tetrahydrofuran-3,4-diol | CHEMBL400189
TypeSmall organic molecule
Emp. Form.C16H23N5O4
Mol. Mass.349.3849
SMILESC[C@@]1(O)[C@H](O)[C@@H](CO)O[C@H]1n1cnc2c(NC3CCCC3)ncnc12