Reaction Details
TargetAdenosine receptor A2a
LigandBDBM50085658
Substrate/Competitorn/a
Meas. Tech.ChEMBL_31057 (CHEMBL873042)
Ki 580±n/a nM
Citation Franchetti, PCappellacci, LMarchetti, STrincavelli, LMartini, CMazzoni, MRLucacchini, AGrifantini, M 2'-C-Methyl analogues of selective adenosine receptor agonists: synthesis and binding studies. J Med Chem41:1708-15 (1998) 
 
Adenosine receptor A2a
Name:Adenosine receptor A2a
Type:G Protein-Coupled Receptor (GPCR)
Mol. Mass.:44716.46
Organism:Homo sapiens (Human)
Description:P29274
Residue:412
BDBM50085658
NameBDBM50085658
Synonyms:(2R,3R,4S,5R)-2-(2-Chloro-6-cyclopentylamino-purin-9-yl)-5-hydroxymethyl-tetrahydro-furan-3,4-diol 2-(2-Chloro-6-cyclopentylamino-purin-9-yl)-5-hydroxymethyl-tetrahydro-furan-3,4-diol 2-Cl-CPA 5-(2-Chloro-6-cyclopentylamino-purin-9-yl)-tetrahydro-furan-2,3,4-triol CHEMBL284969 | N6-Cyclopentyl-2-chloroAdo
TypeSmall organic molecule
Emp. Form.C15H20ClN5O4
Mol. Mass.369.803
SMILESOC[C@H]1O[C@H]([C@H](O)[C@@H]1O)n1cnc2c(NC3CCCC3)nc(Cl)nc12