Reaction Details
TargetAdenosine receptor A1
LigandBDBM50009525
Substrate/Competitorn/a
Meas. Tech.ChEMBL_29131 (CHEMBL637553)
Ki 20±n/a nM
Citation Franchetti, PCappellacci, LMarchetti, STrincavelli, LMartini, CMazzoni, MRLucacchini, AGrifantini, M 2'-C-Methyl analogues of selective adenosine receptor agonists: synthesis and binding studies. J Med Chem41:1708-15 (1998) 
 
Adenosine receptor A1
Name:Adenosine receptor A1
Type:Enzyme Catalytic Domain
Mol. Mass.:36602.99
Organism:BOVINE
Description:ADENOSINE 0 BOVINE::P28190
Residue:326
BDBM50009525
NameBDBM50009525
Synonyms:2-CI Adenosine 2-Chloroado CHEMBL285819
TypeSmall organic molecule
Emp. Form.C10H12ClN5O4
Mol. Mass.301.686
SMILESNc1nc(Cl)nc2n(cnc12)[C@@H]1O[C@H](CO)[C@@H](O)[C@H]1O