Reaction Details
TargetAdenosine receptor A1
LigandBDBM50088422
Substrate/Competitorn/a
Meas. Tech.ChEMBL_29131 (CHEMBL637553)
Ki 19±n/a nM
Citation Franchetti, PCappellacci, LMarchetti, STrincavelli, LMartini, CMazzoni, MRLucacchini, AGrifantini, M 2'-C-Methyl analogues of selective adenosine receptor agonists: synthesis and binding studies. J Med Chem41:1708-15 (1998) 
 
Adenosine receptor A1
Name:Adenosine receptor A1
Type:Enzyme Catalytic Domain
Mol. Mass.:36602.99
Organism:BOVINE
Description:ADENOSINE 0 BOVINE::P28190
Residue:326
BDBM50088422
NameBDBM50088422
Synonyms:(2R,3R,4S,5R)-2-(6-(3-iodobenzylamino)-9H-purin-9-yl)-5-(hydroxymethyl)-tetrahydrofuran-3,4-diol 2-Hydroxymethyl-5-[6-(3-iodo-benzylamino)-purin-9-yl]-tetrahydro-furan-3,4-diol | CHEMBL66393
TypeSmall organic molecule
Emp. Form.C17H18IN5O4
Mol. Mass.483.2604
SMILESOC[C@H]1O[C@H]([C@H](O)[C@@H]1O)n1cnc2c(NCc3cccc(I)c3)ncnc12