Reaction Details
Target5-hydroxytryptamine receptor 1A
LigandBDBM50064559
Substrate/Competitorn/a
Meas. Tech.ChEMBL_1159 (CHEMBL616104)
Ki 2.3±n/a nM
Citation Reitz, ABBaxter, EWCodd, EEDavis, CBJordan, ADMaryanoff, BEMaryanoff, CAMcDonnell, MEPowell, ETRenzi, MJSchott, MRScott, MKShank, RPVaught, JL Orally active benzamide antipsychotic agents with affinity for dopamine D2, serotonin 5-HT1A, and adrenergic alpha1 receptors. J Med Chem41:1997-2009 (1998) 
 
5-hydroxytryptamine receptor 1A
Name:5-hydroxytryptamine receptor 1A
Type:G Protein-Coupled Receptor (GPCR)
Mol. Mass.:46445.29
Organism:Rattus norvegicus (rat)
Description:Binding assays were performed using rat hippocampal membranes.
Residue:422
BDBM50064559
NameBDBM50064559
Synonyms:CHEMBL61470 | Piperidin-1-yl-{3-[4-(3-trifluoromethyl-phenyl)-piperazin-1-ylmethyl]-phenyl}-methanone
TypeSmall organic molecule
Emp. Form.C24H28F3N3O
Mol. Mass.431.4938
SMILESFC(F)(F)c1cccc(c1)N1CCN(Cc2cccc(c2)C(=O)N2CCCCC2)CC1