Reaction Details
Target5-hydroxytryptamine receptor 1A
LigandBDBM50064568
Substrate/Competitorn/a
Meas. Tech.ChEMBL_1159 (CHEMBL616104)
Ki 1.2±n/a nM
Citation Reitz, ABBaxter, EWCodd, EEDavis, CBJordan, ADMaryanoff, BEMaryanoff, CAMcDonnell, MEPowell, ETRenzi, MJSchott, MRScott, MKShank, RPVaught, JL Orally active benzamide antipsychotic agents with affinity for dopamine D2, serotonin 5-HT1A, and adrenergic alpha1 receptors. J Med Chem41:1997-2009 (1998) 
 
5-hydroxytryptamine receptor 1A
Name:5-hydroxytryptamine receptor 1A
Type:G Protein-Coupled Receptor (GPCR)
Mol. Mass.:46445.29
Organism:Rattus norvegicus (rat)
Description:Binding assays were performed using rat hippocampal membranes.
Residue:422
BDBM50064568
NameBDBM50064568
Synonyms:CHEMBL292107 | N-Cyclohexyl-3-[4-(2-isopropoxy-phenyl)-piperazin-1-ylmethyl]-N-methyl-benzamide
TypeSmall organic molecule
Emp. Form.C28H39N3O2
Mol. Mass.449.6282
SMILESCC(C)Oc1ccccc1N1CCN(Cc2cccc(c2)C(=O)N(C)C2CCCCC2)CC1