Reaction Details
Target5-hydroxytryptamine receptor 1A
LigandBDBM50064570
Substrate/Competitorn/a
Meas. Tech.ChEMBL_1159 (CHEMBL616104)
Ki 2.1±n/a nM
Citation Reitz, ABBaxter, EWCodd, EEDavis, CBJordan, ADMaryanoff, BEMaryanoff, CAMcDonnell, MEPowell, ETRenzi, MJSchott, MRScott, MKShank, RPVaught, JL Orally active benzamide antipsychotic agents with affinity for dopamine D2, serotonin 5-HT1A, and adrenergic alpha1 receptors. J Med Chem41:1997-2009 (1998) 
 
5-hydroxytryptamine receptor 1A
Name:5-hydroxytryptamine receptor 1A
Type:G Protein-Coupled Receptor (GPCR)
Mol. Mass.:46445.29
Organism:Rattus norvegicus (rat)
Description:Binding assays were performed using rat hippocampal membranes.
Residue:422
BDBM50064570
NameBDBM50064570
Synonyms:CHEMBL64227 | N,N-Diethyl-3-[4-(2-isopropoxy-phenyl)-piperazin-1-ylmethyl]-benzamide
TypeSmall organic molecule
Emp. Form.C25H35N3O2
Mol. Mass.409.5643
SMILESCCN(CC)C(=O)c1cccc(CN2CCN(CC2)c2ccccc2OC(C)C)c1