Reaction Details
TargetDNA polymerase alpha catalytic subunit
LigandBDBM50408425
Substrate/Competitorn/a
Meas. Tech.ChEMBL_50631 (CHEMBL658098)
IC50>100000±n/a nM
Citation von Janta-Lipinski, MCostisella, BOchs, HHübscher, UHafkemeyer, PMatthes, E Newly synthesized L-enantiomers of 3'-fluoro-modified beta-2'-deoxyribonucleoside 5'-triphosphates inhibit hepatitis B DNA polymerases but not the five cellular DNA polymerases alpha, beta, gamma, delta, and epsilon nor HIV-1 reverse transcriptase. J Med Chem41:2040-6 (1998) 
 
DNA polymerase alpha catalytic subunit
Name:DNA polymerase alpha catalytic subunit
Type:PROTEIN
Mol. Mass.:165895.25
Organism:Homo sapiens (Human)
Description:ChEMBL_1365493
Residue:1462
BDBM50408425
NameBDBM50408425
Synonyms:CHEMBL2092835
TypeSmall organic molecule
Emp. Form.C9H15FN3O12P3
Mol. Mass.469.148
SMILESNc1ccn([C@@H]2C[C@@H](F)[C@H](COP(O)(=O)OP(O)(=O)OP(O)(O)=O)O2)c(=O)n1