Reaction Details
TargetDNA polymerase alpha catalytic subunit
LigandBDBM50408427
Substrate/Competitorn/a
Meas. Tech.ChEMBL_50621 (CHEMBL662220)
IC50 15.0±n/a nM
Citation von Janta-Lipinski, MCostisella, BOchs, HHübscher, UHafkemeyer, PMatthes, E Newly synthesized L-enantiomers of 3'-fluoro-modified beta-2'-deoxyribonucleoside 5'-triphosphates inhibit hepatitis B DNA polymerases but not the five cellular DNA polymerases alpha, beta, gamma, delta, and epsilon nor HIV-1 reverse transcriptase. J Med Chem41:2040-6 (1998) 
 
DNA polymerase alpha catalytic subunit
Name:DNA polymerase alpha catalytic subunit
Type:PROTEIN
Mol. Mass.:165895.25
Organism:Homo sapiens (Human)
Description:ChEMBL_1365493
Residue:1462
BDBM50408427
NameBDBM50408427
Synonyms:CHEMBL483492
TypeSmall organic molecule
Emp. Form.C10H17FN3O12P3
Mol. Mass.483.1746
SMILESCc1cn([C@@H]2C[C@@H](F)[C@H](COP(O)(=O)OP(O)(=O)OP(O)(O)=O)O2)c(=O)nc1N