Reaction Details
TargetReverse transcriptase/RNaseH
LigandBDBM50408426
Substrate/Competitorn/a
Meas. Tech.ChEMBL_197448 (CHEMBL804233)
IC50 100000±n/a nM
Citation von Janta-Lipinski, MCostisella, BOchs, HHübscher, UHafkemeyer, PMatthes, E Newly synthesized L-enantiomers of 3'-fluoro-modified beta-2'-deoxyribonucleoside 5'-triphosphates inhibit hepatitis B DNA polymerases but not the five cellular DNA polymerases alpha, beta, gamma, delta, and epsilon nor HIV-1 reverse transcriptase. J Med Chem41:2040-6 (1998) 
 
Reverse transcriptase/RNaseH
Name:Reverse transcriptase/RNaseH
Type:PROTEIN
Mol. Mass.:65229.15
Organism:Human immunodeficiency virus 1
Description:ChEMBL_1473730
Residue:566
BDBM50408426
NameBDBM50408426
Synonyms:CHEMBL2092833
TypeSmall organic molecule
Emp. Form.C10H16FN2O13P3
Mol. Mass.484.1593
SMILESCc1cn([C@@H]2C[C@@H](F)[C@H](COP(O)(=O)OP(O)(=O)OP(O)(O)=O)O2)c(=O)[nH]c1=O