Reaction Details
TargetMuscarinic acetylcholine receptor M1
LigandBDBM50064609
Substrate/Competitorn/a
Meas. Tech.ChEMBL_138684 (CHEMBL748216)
EC50 23±n/a nM
Citation Pei, XFGupta, THBadio, BPadgett, WLDaly, JW 6beta-Acetoxynortropane: a potent muscarinic agonist with apparent selectivity toward M2-receptors. J Med Chem41:2047-55 (1998) 
 
Muscarinic acetylcholine receptor M1
Name:Muscarinic acetylcholine receptor M1
Type:Enzyme Catalytic Domain
Mol. Mass.:51390.46
Organism:RAT
Description:P08482
Residue:460
BDBM50064609
NameBDBM50064609
Synonyms:6-acetoxy-8-azonia-bicyclo[3.2.1]octane CHEMBL64000
TypeSmall organic molecule
Emp. Form.C9H15NO2
Mol. Mass.169.2209
SMILESCC(=O)OC1CC2CCCC1N2