Reaction Details
TargetMuscarinic acetylcholine receptor M4
LigandBDBM46858
Substrate/Competitorn/a
Meas. Tech.ChEMBL_139124 (CHEMBL749862)
Ki 2400±n/a nM
Citation Pei, XFGupta, THBadio, BPadgett, WLDaly, JW 6beta-Acetoxynortropane: a potent muscarinic agonist with apparent selectivity toward M2-receptors. J Med Chem41:2047-55 (1998) 
 
Muscarinic acetylcholine receptor M4
Name:Muscarinic acetylcholine receptor M4
Type:Enzyme Catalytic Domain
Mol. Mass.:53079.31
Organism:Homo sapiens (Human)
Description:Cholinergic, muscarinic M4 CHRM4 HUMAN M3::P08173
Residue:479
BDBM46858
NameBDBM46858
Synonyms:1-methyl-3,6-dihydro-2H-pyridine-5-carboxylic acid methyl ester;hydrobromide ARECOLINE HYDROBROMIDE SMR000058258 cid_9301 | methyl 1-methyl-3,6-dihydro-2H-pyridine-5-carboxylate;hydrobromide
TypeSmall organic molecule
Emp. Form.C8H13NO2
Mol. Mass.155.1943
SMILESCOC(=O)C1=CCCN(C)C1