Reaction Details
TargetMaltase-glucoamylase
LigandBDBM50259956
Substrate/Competitorn/a
Meas. Tech.ChEMBL_34390 (CHEMBL649260)
IC50 40±n/a nM
Citation Asano, NNishida, MKato, AKizu, HMatsui, KShimada, YItoh, TBaba, MWatson, AANash, RJLilley, PMWatkin, DJFleet, GW Homonojirimycin isomers and N-alkylated homonojirimycins: structural and conformational basis of inhibition of glycosidases. J Med Chem41:2565-71 (1998) 
 
Maltase-glucoamylase
Name:Maltase-glucoamylase
Type:Enzyme
Mol. Mass.:209817.06
Organism:Homo sapiens (Human)
Description:O43451
Residue:2753
BDBM50259956
NameBDBM50259956
Synonyms:2,6-Bis-hydroxymethyl-piperidine-3,4,5-triol US9181184, 34 | alpha-homonojirimycin
TypeSmall organic molecule
Emp. Form.C7H15NO5
Mol. Mass.193.1977
SMILESOC[C@H]1N[C@H](CO)[C@H](O)[C@@H](O)[C@@H]1O