Reaction Details
TargetCalpain-1 catalytic subunit
LigandBDBM50065399
Substrate/Competitorn/a
Meas. Tech.ChEMBL_43870 (CHEMBL658530)
Ki 9±n/a nM
Citation Chatterjee, SGu, ZQDunn, DTao, MJosef, KTripathy, RBihovsky, RSenadhi, SEO'Kane, TMMcKenna, BAMallya, SAtor, MABozyczko-Coyne, DSiman, RMallamo, JP D-amino acid containing, high-affinity inhibitors of recombinant human calpain I. J Med Chem41:2663-6 (1998) 
 
Calpain-1 catalytic subunit
Name:Calpain-1 catalytic subunit
Type:Protein
Mol. Mass.:81880.51
Organism:Homo sapiens (Human)
Description:n/a
Residue:714
BDBM50065399
NameBDBM50065399
Synonyms:(R)-N-((S)-1-Benzyl-2-oxo-ethyl)-3-benzyloxy-2-methanesulfonylamino-butyramide | CHEMBL89766
TypeSmall organic molecule
Emp. Form.C21H26N2O5S
Mol. Mass.418.507
SMILESCC(OCc1ccccc1)[C@@H](NS(C)(=O)=O)C(=O)N[C@@H](Cc1ccccc1)C=O