Reaction Details
TargetCalpain-1 catalytic subunit
LigandBDBM50065411
Substrate/Competitorn/a
Meas. Tech.ChEMBL_43870 (CHEMBL658530)
Ki 9±n/a nM
Citation Chatterjee, SGu, ZQDunn, DTao, MJosef, KTripathy, RBihovsky, RSenadhi, SEO'Kane, TMMcKenna, BAMallya, SAtor, MABozyczko-Coyne, DSiman, RMallamo, JP D-amino acid containing, high-affinity inhibitors of recombinant human calpain I. J Med Chem41:2663-6 (1998) 
 
Calpain-1 catalytic subunit
Name:Calpain-1 catalytic subunit
Type:Protein
Mol. Mass.:81880.51
Organism:Homo sapiens (Human)
Description:n/a
Residue:714
BDBM50065411
NameBDBM50065411
Synonyms:(R)-N-((S)-1-Benzyl-2-oxo-ethyl)-2-methanesulfonylamino-2-phenyl-acetamide | CHEMBL88484
TypeSmall organic molecule
Emp. Form.C18H20N2O4S
Mol. Mass.360.427
SMILESCS(=O)(=O)N[C@@H](C(=O)N[C@@H](Cc1ccccc1)C=O)c1ccccc1