Reaction Details
TargetCathepsin B
LigandBDBM50065404
Substrate/Competitorn/a
Meas. Tech.ChEMBL_47431 (CHEMBL662618)
Ki 4±n/a nM
Citation Chatterjee, SGu, ZQDunn, DTao, MJosef, KTripathy, RBihovsky, RSenadhi, SEO'Kane, TMMcKenna, BAMallya, SAtor, MABozyczko-Coyne, DSiman, RMallamo, JP D-amino acid containing, high-affinity inhibitors of recombinant human calpain I. J Med Chem41:2663-6 (1998) 
 
Cathepsin B
Name:Cathepsin B
Type:Enzyme
Mol. Mass.:37819.69
Organism:Homo sapiens (Human)
Description:gi_63102437
Residue:339
BDBM50065404
NameBDBM50065404
Synonyms:(R)-N-((S)-5-Benzenesulfonylamino-1-formyl-pentyl)-3-benzyloxy-2-methanesulfonylamino-propionamide | CHEMBL89100
TypeSmall organic molecule
Emp. Form.C23H31N3O7S2
Mol. Mass.525.638
SMILESCS(=O)(=O)N[C@H](COCc1ccccc1)C(=O)N[C@@H](CCCCNS(=O)(=O)c1ccccc1)C=O