Reaction Details
TargetAdenosine receptor A3
LigandBDBM21220
Substrate/Competitorn/a
Meas. Tech.ChEMBL_30333 (CHEMBL637928)
Ki 110±n/a nM
Citation Matsuda, AKosaki, HSaitoh, YYoshimura, YMinakawa, NNakata, H Nucleosides and nucleotides. 177. 9-(6,7-dideoxy-beta-D-allo-hept-5- ynofuranosyl)adenine: a selective and potent ligand for P3 purinoceptor-like protein. J Med Chem41:2676-8 (1998) 
 
Adenosine receptor A3
Name:Adenosine receptor A3
Type:PROTEIN
Mol. Mass.:36643.73
Organism:Rattus norvegicus
Description:ChEMBL_479910
Residue:320
BDBM21220
NameBDBM21220
Synonyms:(2S,3S,4R,5R)-5-(6-amino-9H-purin-9-yl)-N-ethyl-3,4-dihydroxyoxolane-2-carboxamide Adenosine, N6-Ethyl-carboxamido CHEMBL464859 NECA
TypeAntineoplastic Agent
Emp. Form.C12H16N6O4
Mol. Mass.308.2932
SMILESCCNC(=O)[C@H]1O[C@H]([C@H](O)[C@@H]1O)n1cnc2c(N)ncnc12