Reaction Details
TargetNitric oxide synthase, inducible
LigandBDBM50065823
Substrate/Competitorn/a
Meas. Tech.ChEMBL_89333 (CHEMBL702708)
Ki 21±n/a nM
Citation Collins, JLShearer, BGOplinger, JALee, SGarvey, EPSalter, MDuffy, CBurnette, TCFurfine, ES N-Phenylamidines as selective inhibitors of human neuronal nitric oxide synthase: structure-activity studies and demonstration of in vivo activity. J Med Chem41:2858-71 (1998) 
 
Nitric oxide synthase, inducible
Name:Nitric oxide synthase, inducible
Type:Homodimer
Mol. Mass.:131141.95
Organism:Homo sapiens (Human)
Description:P35228
Residue:1153
BDBM50065823
NameBDBM50065823
Synonyms:CHEMBL555794 | N-(3-Aminomethyl-phenyl)-2-methylsulfanyl-acetamidine
TypeSmall organic molecule
Emp. Form.C10H15N3S
Mol. Mass.209.311
SMILESCSCC(N)=Nc1cccc(CN)c1