Reaction Details
TargetNitric oxide synthase, brain
LigandBDBM50065833
Substrate/Competitorn/a
Meas. Tech.ChEMBL_143377 (CHEMBL752276)
Ki 40±n/a nM
Citation Collins, JLShearer, BGOplinger, JALee, SGarvey, EPSalter, MDuffy, CBurnette, TCFurfine, ES N-Phenylamidines as selective inhibitors of human neuronal nitric oxide synthase: structure-activity studies and demonstration of in vivo activity. J Med Chem41:2858-71 (1998) 
 
Nitric oxide synthase, brain
Name:Nitric oxide synthase, brain
Type:Homodimer
Mol. Mass.:160985.98
Organism:Homo sapiens (Human)
Description:P29475
Residue:1434
BDBM50065833
NameBDBM50065833
Synonyms:CHEMBL542432 | N-(4-Aminomethyl-phenyl)-acetamidine
TypeSmall organic molecule
Emp. Form.C9H13N3
Mol. Mass.163.2196
SMILESCC(N)=Nc1ccc(CN)cc1