Reaction Details
TargetNitric oxide synthase, endothelial
LigandBDBM50065843
Substrate/Competitorn/a
Meas. Tech.ChEMBL_65318 (CHEMBL678091)
Ki 400±n/a nM
Citation Collins, JLShearer, BGOplinger, JALee, SGarvey, EPSalter, MDuffy, CBurnette, TCFurfine, ES N-Phenylamidines as selective inhibitors of human neuronal nitric oxide synthase: structure-activity studies and demonstration of in vivo activity. J Med Chem41:2858-71 (1998) 
 
Nitric oxide synthase, endothelial
Name:Nitric oxide synthase, endothelial
Type:Enzyme Catalytic Domain
Mol. Mass.:133297.84
Organism:Homo sapiens (Human)
Description:P29474
Residue:1203
BDBM50065843
NameBDBM50065843
Synonyms:CHEMBL553081 N-(3-Aminomethyl-phenyl)-thiophene-2-carboxamidine
TypeSmall organic molecule
Emp. Form.C12H13N3S
Mol. Mass.231.317
SMILESNCc1cccc(c1)N=C(N)c1cccs1