Reaction Details
Target5-hydroxytryptamine receptor 3A/3B
LigandBDBM50449636
Substrate/Competitorn/a
Meas. Tech.ChEMBL_3238 (CHEMBL618924)
Ki 0.500000±n/a nM
Citation Sato, YYamada, MYoshida, SSoneda, TIshikawa, MNizato, TSuzuki, KKonno, F Benzoxazole derivatives as novel 5-HT3 receptor partial agonists in the gut. J Med Chem41:3015-21 (1998) 
 
5-hydroxytryptamine receptor 3A/3B
Name:5-hydroxytryptamine receptor 3A/3B
Type:n/a
Mol. Mass.:n/a
Description:ASSAY_ID of EBI is 2974
Components:This complex has 2 components.
Component 1
Name:5-hydroxytryptamine receptor 3B
Synonyms:5HT3B_RAT Serotonin (5-HT) receptor
Type:PROTEIN
Mol. Mass.:50328.78
Organism:Rattus norvegicus
Description:EBI_11885
Residue:437
Component 2
Name:5-hydroxytryptamine receptor 3A
Synonyms:5-HT3 5HT3A_RAT Htr3 Serotonin (5-HT) receptor | Zacopride site-R
Type:Enzyme Catalytic Domain
Mol. Mass.:55428.70
Organism:RAT
Description:5-HT3 HTR3A RAT::P35563
Residue:483
BDBM50449636
NameBDBM50449636
Synonyms:BRL-43694 Kytril Sancuso
TypeSmall organic molecule
Emp. Form.C18H24N4O
Mol. Mass.312.4094
SMILES[H][C@]12CCC[C@]([H])(C[C@H](C1)NC(=O)c1nn(C)c3ccccc13)N2C