Reaction Details
TargetAdenosylhomocysteinase
LigandBDBM50369379
Substrate/Competitorn/a
Meas. Tech.ChEMBL_196552 (CHEMBL801947)
Ki 3900±n/a nM
Citation Wnuk, SFMao, YYuan, CSBorchardt, RTAndrei, GBalzarini, JDe Clercq, ERobins, MJ Discovery of type II (covalent) inactivation of S-adenosyl-L-homocysteine hydrolase involving its"hydrolytic activity": synthesis and evaluation of dihalohomovinyl nucleoside analogues derived from adenosine. J Med Chem41:3078-83 (1998) 
 
Adenosylhomocysteinase
Name:Adenosylhomocysteinase
Type:PROTEIN
Mol. Mass.:47714.06
Organism:Homo sapiens (Human)
Description:ChEMBL_1507791
Residue:432
BDBM50369379
NameBDBM50369379
Synonyms:CHEMBL607755
TypeSmall organic molecule
Emp. Form.C11H11BrFN5O3
Mol. Mass.360.139
SMILESNc1ncnc2n(cnc12)C1O[C@H](\C=C(\F)Br)[C@@H](O)[C@H]1O