Reaction Details
TargetAlpha-1B adrenergic receptor
LigandBDBM50369383
Substrate/Competitorn/a
Meas. Tech.ChEMBL_34340 (CHEMBL649153)
Ki 0.42±n/a nM
Citation Chern, JWTao, PLWang, KCGutcait, ALiu, SWYen, MHChien, SLRong, JK Studies on quinazolines and 1,2,4-benzothiadiazine 1,1-dioxides. 8.1, 2 synthesis and pharmacological evaluation of tricyclic fused quinazolines and 1,2,4-benzothiadiazine 1,1-dioxides as potential alpha1-adrenoceptor antagonists. J Med Chem41:3128-41 (1998) 
 
Alpha-1B adrenergic receptor
Name:Alpha-1B adrenergic receptor
Type:G Protein-Coupled Receptor (GPCR)
Mol. Mass.:56606.71
Organism:Rattus norvegicus (rat)
Description:Receptor binding assays were performed using rat cortical membranes.
Residue:515
BDBM50369383
NameBDBM50369383
Synonyms:CHEMBL1788222
TypeSmall organic molecule
Emp. Form.C22H25N5O2
Mol. Mass.391.4662
SMILESCOc1ccccc1N1CCN(C[C@H]2CN=C3N2C(=O)Nc2ccccc32)CC1