Reaction Details
TargetSubstance-P receptor
LigandBDBM50066166
Substrate/Competitorn/a
Meas. Tech.ChEMBL_205880 (CHEMBL813941)
Ki 36±n/a nM
Citation Walpole, CKo, SYBrown, MBeattie, DCampbell, EDickenson, FEwan, SHughes, GALemaire, MLerpiniere, JPatel, SUrban, L 2-Nitrophenylcarbamoyl-(S)-prolyl-(S)-3-(2-naphthyl)alanyl-N-benzyl-N - methylamide (SDZ NKT 343), a potent human NK1 tachykinin receptor antagonist with good oral analgesic activity in chronic pain models. J Med Chem41:3159-73 (1998) 
 
Substance-P receptor
Name:Substance-P receptor
Type:G Protein-Coupled Receptor (GPCR)
Mol. Mass.:46254.43
Organism:Homo sapiens (Human)
Description:P25103
Residue:407
BDBM50066166
NameBDBM50066166
Synonyms:(S)-1-(2-Chloro-benzylthiocarbamoyl)-pyrrolidine-2-carboxylic acid [(S)-1-(methyl-naphthalen-2-ylmethyl-carbamoyl)-2-phenyl-ethyl]-amide | CHEMBL323044
TypeSmall organic molecule
Emp. Form.C34H35ClN4O2S
Mol. Mass.599.185
SMILESCN(Cc1ccc2ccccc2c1)C(=O)[C@H](Cc1ccccc1)NC(=O)[C@@H]1CCCN1C(=S)NCc1ccccc1Cl